Target
Intestinal-type alkaline phosphatase
Ligand
BDBM60205
Substrate
Meas. Tech.
Dose Response confirmation of uHTS inhibitors of Mouse Intestinal Alkaline Phosphatase using Human Intestinal Alkaline Phosphatase
IC50
>100000±n/a nM
Citation
 PubChem, PC Dose Response confirmation of uHTS inhibitors of Mouse Intestinal Alkaline Phosphatase using Human Intestinal Alkaline Phosphatase PubChem Bioassay (2010)[AID] 
Target
Name:
Intestinal-type alkaline phosphatase
Synonyms:
ALPI Intestinal alkaline phosphatase | PPBI_HUMAN
Type:
PROTEIN
Mol. Mass.:
56804.94
Organism:
Homo sapiens (Human)
Description:
ChEMBL_1278525
Residue:
528
  
Inhibitor
Name:
BDBM60205
Synonyms:
MLS001006819 N,N'-bis(4-oxidanylidene-2-sulfanylidene-1,3-thiazolidin-3-yl)ethanediamide N,N'-bis(4-oxo-2-sulfanylidene-3-thiazolidinyl)oxamide cid_2355982
Type:
Small organic molecule
Emp. Form.:
C8H6N4O4S4
Mol. Mass.:
350.418
SMILES:
Oc1csc(=S)n1NC(=O)C(=O)Nn1c(O)csc1=S
: