Target
Intestinal-type alkaline phosphatase
Ligand
BDBM52705
Substrate
Meas. Tech.
Dose Response confirmation of uHTS inhibitors of Mouse Intestinal Alkaline Phosphatase using Human Intestinal Alkaline Phosphatase
IC50
>100000±n/a nM
Citation
 PubChem, PC Dose Response confirmation of uHTS inhibitors of Mouse Intestinal Alkaline Phosphatase using Human Intestinal Alkaline Phosphatase PubChem Bioassay (2010)[AID] 
Target
Name:
Intestinal-type alkaline phosphatase
Synonyms:
ALPI Intestinal alkaline phosphatase | PPBI_HUMAN
Type:
PROTEIN
Mol. Mass.:
56804.94
Organism:
Homo sapiens (Human)
Description:
ChEMBL_1278525
Residue:
528
  
Inhibitor
Name:
BDBM52705
Synonyms:
(5E)-1-methyl-5-[(5-nitro-2-furanyl)methylidene]-1,3-diazinane-2,4,6-trione (5E)-1-methyl-5-[(5-nitro-2-furyl)methylene]pyrimidine-2,4,6(1H,3H,5H)-trione (5Z)-1-methyl-5-[(5-nitro-2-furyl)methylene]barbituric acid SMR000305431 | cid_1909603
Type:
Small organic molecule
Emp. Form.:
C10H7N3O6
Mol. Mass.:
265.1791
SMILES:
Cn1c(=O)[nH]c([O-])c([CH+]c2ccc(o2)[N+]([O-])=O)c1=O
: