Target
Intestinal-type alkaline phosphatase
Ligand
BDBM76211
Substrate
Meas. Tech.
Dose Response confirmation of uHTS inhibitors of Mouse Intestinal Alkaline Phosphatase using Human Intestinal Alkaline Phosphatase
IC50
8640±n/a nM
Citation
 PubChem, PC Dose Response confirmation of uHTS inhibitors of Mouse Intestinal Alkaline Phosphatase using Human Intestinal Alkaline Phosphatase PubChem Bioassay (2010)[AID] 
Target
Name:
Intestinal-type alkaline phosphatase
Synonyms:
ALPI Intestinal alkaline phosphatase | PPBI_HUMAN
Type:
PROTEIN
Mol. Mass.:
56804.94
Organism:
Homo sapiens (Human)
Description:
ChEMBL_1278525
Residue:
528
  
Inhibitor
Name:
BDBM76211
Synonyms:
MLS001083154 N-[3-(3-chlorophenyl)phenyl]-1-cyclobutyl-isonipecotamide N-[3-(3-chlorophenyl)phenyl]-1-cyclobutylpiperidine-4-carboxamide cid_24790619
Type:
Small organic molecule
Emp. Form.:
C22H25ClN2O
Mol. Mass.:
368.9
SMILES:
Clc1cccc(c1)-c1cccc(NC(=O)C2CCN(CC2)C2CCC2)c1
: