Target
Alkaline phosphatase, germ cell type
Ligand
BDBM54641
Substrate
Meas. Tech.
Dose Response confirmation of uHTS inhibitors of Mouse Intestinal Alkaline Phosphatase using Placental Alkaline Phosphatase
IC50
>100000±n/a nM
Citation
 PubChem, PC Dose Response confirmation of uHTS inhibitors of Mouse Intestinal Alkaline Phosphatase using Placental Alkaline Phosphatase PubChem Bioassay (2010)[AID] 
Target
Name:
Alkaline phosphatase, germ cell type
Synonyms:
ALPG ALPPL2 PPBN_HUMAN | placental-like alkaline phosphatase preproprotein
Type:
PROTEIN
Mol. Mass.:
57374.31
Organism:
Homo sapiens (Human)
Description:
ChEMBL_29964
Residue:
532
  
Inhibitor
Name:
BDBM54641
Synonyms:
4-[3-(2-chlorophenyl)-5-(4-methoxyphenyl)-2-pyrazolin-1-yl]benzenesulfonamide KUC103416N cid_42628052
Type:
Small organic molecule
Emp. Form.:
C22H20ClN3O3S
Mol. Mass.:
441.931
SMILES:
COc1ccc(cc1)C1CC(=NN1c1ccc(cc1)S(N)(=O)=O)c1ccccc1Cl
: