Target
Alkaline phosphatase, tissue-nonspecific isozyme
Ligand
BDBM76158
Substrate
Meas. Tech.
Dose Response confirmation of uHTS activators of Mouse Intestinal Alkaline Phosphatase using Tissue Nonspecific Alkaline Phosphatase.
EC50
28100±n/a nM
Citation
 PubChem, PC Dose Response confirmation of uHTS activators of Mouse Intestinal Alkaline Phosphatase using Tissue Nonspecific Alkaline Phosphatase. PubChem Bioassay (2010)[AID] 
Target
Name:
Alkaline phosphatase, tissue-nonspecific isozyme
Synonyms:
ALPL tissue-nonspecific alkaline phosphatase precursor
Type:
PROTEIN
Mol. Mass.:
57306.17
Organism:
Homo sapiens (Human)
Description:
ChEMBL_1448917
Residue:
524
  
Inhibitor
Name:
BDBM76158
Synonyms:
MLS001096124 N-(2-chloro-4-methyl-phenyl)-3-[(2-keto-3H-1,3-benzoxazol-6-yl)sulfonylamino]propionamide SMR000631042 | cid_24790988
Type:
Small organic molecule
Emp. Form.:
C17H16ClN3O5S
Mol. Mass.:
409.844
SMILES:
Cc1ccc(NC(=O)CCNS(=O)(=O)c2ccc3[nH]c(=O)oc3c2)c(Cl)c1
: