Target
Caspase-3
Ligand
BDBM61741
Substrate
Meas. Tech.
Dose Response confirmation of inhibitors of Sentrin-specific proteases (SENPs) using a Caspase-3 Selectivity assay
IC50
1610±n/a nM
Citation
 PubChem, PC Dose Response confirmation of inhibitors of Sentrin-specific proteases (SENPs) using a Caspase-3 Selectivity assay PubChem Bioassay (2010)[AID] 
Target
Name:
Caspase-3
Synonyms:
Apopain CASP3 CPP-32 Caspase 3 Caspase-3 subunit p17 SCA-1 Yama protein | caspase-3 preproprotein
Type:
Hydrolase; heterotetramer of two heterodimers
Mol. Mass.:
31607.55
Organism:
Homo sapiens (Human)
Description:
Residue:
277
  
Inhibitor
Name:
BDBM61741
Synonyms:
2-[(E)-2-(2-chlorophenyl)ethenyl]-1H-quinazolin-4-one MLS001173656 cid_5898073
Type:
Small organic molecule
Emp. Form.:
C16H11ClN2O
Mol. Mass.:
282.724
SMILES:
Clc1ccccc1C=Cc1nc2ccccc2c(=O)[nH]1
: