Target
Alkaline phosphatase, tissue-nonspecific isozyme
Ligand
BDBM53127
Substrate
Meas. Tech.
Dose Response confirmation of uHTS inhibitors of Mouse Intestinal Alkaline Phosphatase using Tissue Nonspecific Alkaline Phosphatase.
IC50
76100±n/a nM
Citation
 PubChem, PC Dose Response confirmation of uHTS inhibitors of Mouse Intestinal Alkaline Phosphatase using Tissue Nonspecific Alkaline Phosphatase. PubChem Bioassay (2010)[AID] 
Target
Name:
Alkaline phosphatase, tissue-nonspecific isozyme
Synonyms:
ALPL tissue-nonspecific alkaline phosphatase precursor
Type:
PROTEIN
Mol. Mass.:
57306.17
Organism:
Homo sapiens (Human)
Description:
ChEMBL_1448917
Residue:
524
  
Inhibitor
Name:
BDBM53127
Synonyms:
3-[3-(3-Furan-2-yl-acryloyl)-thioureido]-benzoic acid 3-[[(E)-3-(furan-2-yl)prop-2-enoyl]carbamothioylamino]benzoic acid MLS001211481 cid_845479
Type:
Small organic molecule
Emp. Form.:
C15H12N2O4S
Mol. Mass.:
316.332
SMILES:
OC(=O)c1cccc(NC(=S)NC(=O)C=Cc2ccco2)c1
: