Target
Sentrin-specific protease 6
Ligand
BDBM76454
Substrate
Meas. Tech.
Dose Response confirmation of uHTS for inhibitors of Sentrin-specific protease 6 (SENP6) using a Luminescent assay
IC50
13600±n/a nM
Citation
 PubChem, PC Dose Response confirmation of uHTS for inhibitors of Sentrin-specific protease 6 (SENP6) using a Luminescent assay PubChem Bioassay (2010)[AID] 
Target
Name:
Sentrin-specific protease 6
Synonyms:
KIAA0797 SENP6_HUMAN SUMO-1-specific protease Sentrin-specific protease 6 (SENP6)
Type:
Enzyme Catalytic Domain
Mol. Mass.:
126147.68
Organism:
Homo sapiens (Human)
Description:
Q9GZR1
Residue:
1112
  
Inhibitor
Name:
BDBM76454
Synonyms:
(6Z)-6-[5-[(E)-2-(3,4-dimethoxyphenyl)ethenyl]-1,2-dihydro-1,2,4-triazol-3-ylidene]-1-cyclohexa-2,4-dienone (6Z)-6-[5-[(E)-2-(3,4-dimethoxyphenyl)vinyl]-1,2-dihydro-1,2,4-triazol-3-ylidene]cyclohexa-2,4-dien-1-one MLS000583690 cid_5807995
Type:
Small organic molecule
Emp. Form.:
C18H17N3O3
Mol. Mass.:
323.3459
SMILES:
COc1ccc(C=Cc2nnc([nH]2)-c2ccccc2O)cc1OC
: