Target
Sentrin-specific protease 6
Ligand
BDBM73835
Substrate
Meas. Tech.
Dose Response confirmation of uHTS for inhibitors of Sentrin-specific protease 6 (SENP6) using a Luminescent assay
IC50
8990±n/a nM
Citation
 PubChem, PC Dose Response confirmation of uHTS for inhibitors of Sentrin-specific protease 6 (SENP6) using a Luminescent assay PubChem Bioassay (2010)[AID] 
Target
Name:
Sentrin-specific protease 6
Synonyms:
KIAA0797 SENP6_HUMAN SUMO-1-specific protease Sentrin-specific protease 6 (SENP6)
Type:
Enzyme Catalytic Domain
Mol. Mass.:
126147.68
Organism:
Homo sapiens (Human)
Description:
Q9GZR1
Residue:
1112
  
Inhibitor
Name:
BDBM73835
Synonyms:
1-({4-[(4-fluorobenzyl)oxy]phenyl}carbonothioyl)pyrrolidine SMR000497283 [4-[(4-fluorophenyl)methoxy]phenyl]-(1-pyrrolidinyl)methanethione [4-[(4-fluorophenyl)methoxy]phenyl]-pyrrolidin-1-ylmethanethione | cid_800285
Type:
Small organic molecule
Emp. Form.:
C18H18FNOS
Mol. Mass.:
315.405
SMILES:
Fc1ccc(COc2ccc(cc2)C(=S)N2CCCC2)cc1
: