Target
Voltage-dependent T-type calcium channel subunit alpha-1H
Ligand
BDBM51803
Substrate
Meas. Tech.
Inhibitors of T-Type Calcium Channel
EC50
2210±0 nM
Citation
 PubChem, PC Inhibitors of T-Type Calcium Channel PubChem Bioassay (2010)[AID] 
Target
Name:
Voltage-dependent T-type calcium channel subunit alpha-1H
Synonyms:
CAC1H_HUMAN Low-voltage-activated calcium channel alpha1 3.2 subunit Voltage-gated calcium channel voltage-dependent T-type calcium channel subunit alpha-1H isoform a
Type:
Enzyme Catalytic Domain
Mol. Mass.:
259187.68
Organism:
Homo sapiens (Human)
Description:
Calcium channel (Type T,L) 0 0::O95180
Residue:
2353
  
Inhibitor
Name:
BDBM51803
Synonyms:
2-[4-(Acetyl-phenyl-amino)-buta-1,3-dienyl]-3-ethyl-benzothiazol-3-ium N-[(1E,3E)-4-(3-ethyl-1,3-benzothiazol-3-ium-2-yl)buta-1,3-dienyl]-N-phenyl-acetamide;iodide N-[(1E,3E)-4-(3-ethyl-1,3-benzothiazol-3-ium-2-yl)buta-1,3-dienyl]-N-phenylacetamide;iodide cid_5717129
Type:
Small organic molecule
Emp. Form.:
C21H21N2OS
Mol. Mass.:
349.469
SMILES:
CC[n+]1c(\C=C\C=C\N(C(C)=O)c2ccccc2)sc2ccccc12
: