Target
Ubiquitin-conjugating enzyme E2 N
Ligand
BDBM51857
Substrate
Meas. Tech.
Dose Response confirmation of uHTS for the identification of UBC13 Polyubiquitin Inhibitors via a TR-FRET Assay
IC50
5584±402 nM
Citation
 PubChem, PC Dose Response confirmation of uHTS for the identification of UBC13 Polyubiquitin Inhibitors via a TR-FRET Assay PubChem Bioassay (2011)[AID] 
Target
Name:
Ubiquitin-conjugating enzyme E2 N
Synonyms:
BLU UBE2N_HUMAN | ubiquitin-conjugating enzyme E2 N
Type:
PROTEIN
Mol. Mass.:
17137.61
Organism:
Homo sapiens (Human)
Description:
EBI_101440
Residue:
152
  
Inhibitor
Name:
BDBM51857
Synonyms:
MLS001010894 N-[4-(3-bromophenyl)-1,3-thiazol-2-yl]-2-[3-[3-(dimethylamino)propyl]-4-oxoquinazolin-2-yl]sulfanylacetamide N-[4-(3-bromophenyl)thiazol-2-yl]-2-[[3-[3-(dimethylamino)propyl]-4-keto-quinazolin-2-yl]thio]acetamide cid_2080746
Type:
Small organic molecule
Emp. Form.:
C24H24BrN5O2S2
Mol. Mass.:
558.514
SMILES:
CN(C)CCCn1c(SCC(=O)Nc2nc(cs2)-c2cccc(Br)c2)nc2ccccc2c1=O
: