Target
X-box-binding protein 1
Ligand
BDBM51857
Substrate
Meas. Tech.
XBP1 DR counterscreen for CHOP
IC50
9390±n/a nM
Citation
 PubChem, PC XBP1 DR counterscreen for CHOP PubChem Bioassay (2011)[AID] 
Target
Name:
X-box-binding protein 1
Synonyms:
TREB5 XBP1_HUMAN | XBP2
Type:
Enzyme Catalytic Domain
Mol. Mass.:
28704.14
Organism:
Homo sapiens (Human)
Description:
gi_47678753
Residue:
261
  
Inhibitor
Name:
BDBM51857
Synonyms:
MLS001010894 N-[4-(3-bromophenyl)-1,3-thiazol-2-yl]-2-[3-[3-(dimethylamino)propyl]-4-oxoquinazolin-2-yl]sulfanylacetamide N-[4-(3-bromophenyl)thiazol-2-yl]-2-[[3-[3-(dimethylamino)propyl]-4-keto-quinazolin-2-yl]thio]acetamide cid_2080746
Type:
Small organic molecule
Emp. Form.:
C24H24BrN5O2S2
Mol. Mass.:
558.514
SMILES:
CN(C)CCCn1c(SCC(=O)Nc2nc(cs2)-c2cccc(Br)c2)nc2ccccc2c1=O
: