Target
DNA damage-inducible transcript 3 protein
Ligand
BDBM67807
Substrate
Meas. Tech.
CHOP dose-response primary assay
IC50
4940±n/a nM
Citation
 PubChem, PC CHOP dose-response primary assay PubChem Bioassay (2011)[AID] 
Target
Name:
DNA damage-inducible transcript 3 protein
Synonyms:
Chop DDIT3_MOUSE Gadd153
Type:
Enzyme Catalytic Domain
Mol. Mass.:
19175.17
Organism:
Mus musculus
Description:
gi_160707929
Residue:
168
  
Inhibitor
Name:
BDBM67807
Synonyms:
5-(4-methylbenzyl)-7-(trifluoromethyl)-3,3a-dihydro-1H-thiazolo[3,4-a]quinoxalin-4-one 5-[(4-methylphenyl)methyl]-7-(trifluoromethyl)-3,3a-dihydro-1H-[1,3]thiazolo[3,4-a]quinoxalin-4-one MLS000541396 cid_3806160
Type:
Small organic molecule
Emp. Form.:
C19H17F3N2OS
Mol. Mass.:
378.411
SMILES:
Cc1ccc(CN2C(=O)C3CSCN3c3ccc(cc23)C(F)(F)F)cc1
: