Target
Gag-Pol polyprotein [588-1127,Y768C]/[588-1147,Y768C]
Ligand
BDBM2733
Substrate
(rC)n.(dG)12-18
Meas. Tech.
HIV-1 RT Assay
IC50
10±n/a nM
Citation
 Hogberg, MSahlberg, CEngelhardt, PNoreen, RKangasmetsa, JJohansson, NGOberg, BVrang, LZhang, HSahlberg, BLUnge, TLovgren, SFridborg, KBackbro, K Urea-PETT compounds as a new class of HIV-1 reverse transcriptase inhibitors. 3. Synthesis and further structure-activity relationship studies of PETT analogues. J Med Chem 42:4150-60 (1999)  
Target
Name:
Gag-Pol polyprotein [588-1127,Y768C]/[588-1147,Y768C]
Synonyms:
EC: 2.7.7.49 | HIV-1 Reverse Transcriptase Mutant (Y181C)
Type:
Protein Complex
Mol. Mass.:
Description:
Components:
This complex has 2 components.
Component 1
Name:
Gag-Pol polyprotein [588-1147,Y768C]
Synonyms:
HIV-1 Reverse Transcriptase Mutant (Y181C) Chain A gag-pol
Type:
Enzyme Subunit
Mol. Mass.:
64426.38
Organism:
Human immunodeficiency virus type 1
Description:
P04585[588-1147,Y768C]
Residue:
560
  
Component 2
Name:
Gag-Pol polyprotein [588-1127,Y768C]
Synonyms:
HIV-1 Reverse Transcriptase Mutant (Y181C) Chain B gag-pol
Type:
Enzyme Subunit
Mol. Mass.:
51277.10
Organism:
Human immunodeficiency virus type 1
Description:
P04585[588-1127,Y768C]
Residue:
440
  
Inhibitor
Name:
BDBM2733
Synonyms:
(1S,2S)-N-[cis-2-(6-Fluoro-2-hydroxy-3-propionylphenyl)cyclopropyl]-N-[2-(5-bromopyridyl)]urea urea-PETT deriv. 18
Type:
Small organic molecule
Emp. Form.:
C18H17BrFN3O3
Mol. Mass.:
422.248
SMILES:
CCC(=O)c1ccc(F)c([C@@H]2C[C@@H]2NC(=O)Nc2ccc(Br)cn2)c1O
:
Substrate
Name:
(rC)n.(dG)12-18
Synonyms:
Type:
RNA-DNA duplex
Mol. Mass.:
358.43
Organism:
Description:
The incorporation of Tritium-labeled dGTP onto a poly(rC):oligo(dG)template:primer.
Residue:
3
NA