Target
Sphingosine 1-phosphate receptor 4
Ligand
BDBM79472
Substrate
Meas. Tech.
Late-stage fluorescence dose response cell-based assay to identify agonists of the Sphingosine 1-Phosphate Receptor 4 (S1P4): purchased compounds EC50
EC50
>50000±n/a nM
Citation
 PubChem, PC Late-stage fluorescence dose response cell-based assay to identify agonists of the Sphingosine 1-Phosphate Receptor 4 (S1P4): purchased compounds EC50 PubChem Bioassay (2011)[AID] 
Target
Name:
Sphingosine 1-phosphate receptor 4
Synonyms:
EDG6 S1P receptor 4 S1P4 S1PR4_HUMAN Sphingosine 1-phosphate receptor Edg-6 sphingosine-1-phosphate 4 S1P4
Type:
G Protein-Coupled Receptor (GPCR)
Mol. Mass.:
41647.39
Organism:
Homo sapiens (Human)
Description:
Residue:
384
  
Inhibitor
Name:
BDBM79472
Synonyms:
1-benzyl-5-chloro-3-methyl-pyrazole-4-carboxylic acid [2-keto-1-methyl-2-(4-propylphenyl)ethyl] ester SR-02000000314 [1-oxidanylidene-1-(4-propylphenyl)propan-2-yl] 5-chloranyl-3-methyl-1-(phenylmethyl)pyrazole-4-carboxylate cid_3368676
Type:
Small organic molecule
Emp. Form.:
C24H25ClN2O3
Mol. Mass.:
424.92
SMILES:
CCCc1ccc(cc1)C(=O)C(C)OC(=O)c1c(C)nn(Cc2ccccc2)c1Cl
: