Target
Mitochondrial import inner membrane translocase subunit TIM23
Ligand
BDBM65175
Substrate
Meas. Tech.
Dose Response confirmation of uHTS small molecule inhibitors of tim10-1: a luminescent tim23-1 yeast counterscreen.
IC50
7040±n/a nM
Citation
 PubChem, PC Dose Response confirmation of uHTS small molecule inhibitors of tim10-1: a luminescent tim23-1 yeast counterscreen. PubChem Bioassay (2011)[AID] 
Target
Name:
Mitochondrial import inner membrane translocase subunit TIM23
Synonyms:
MAS6 MPI3 TIM23_YEAST | TPA: Essential component of the Translocase of the Inner Mitochondrial membrane (TIM23 complex)
Type:
Enzyme Catalytic Domain
Mol. Mass.:
23245.32
Organism:
Saccharomyces cerevisiae S288c
Description:
gi_285814664
Residue:
222
  
Inhibitor
Name:
BDBM65175
Synonyms:
1-[(2,4-dichlorobenzoyl)amino]-3-[3-(trifluoromethyl)phenyl]thiourea 1-[[(2,4-dichlorophenyl)-oxomethyl]amino]-3-[3-(trifluoromethyl)phenyl]thiourea SMR000212491 | cid_3729816
Type:
Small organic molecule
Emp. Form.:
C15H10Cl2F3N3OS
Mol. Mass.:
408.226
SMILES:
FC(F)(F)c1cccc(NC(=S)NNC(=O)c2ccc(Cl)cc2Cl)c1
: