Target
Mitochondrial import inner membrane translocase subunit TIM23
Ligand
BDBM78218
Substrate
Meas. Tech.
Dose Response confirmation of uHTS small molecule inhibitors of tim10-1: a luminescent tim23-1 yeast counterscreen.
IC50
2610±n/a nM
Citation
 PubChem, PC Dose Response confirmation of uHTS small molecule inhibitors of tim10-1: a luminescent tim23-1 yeast counterscreen. PubChem Bioassay (2011)[AID] 
Target
Name:
Mitochondrial import inner membrane translocase subunit TIM23
Synonyms:
MAS6 MPI3 TIM23_YEAST | TPA: Essential component of the Translocase of the Inner Mitochondrial membrane (TIM23 complex)
Type:
Enzyme Catalytic Domain
Mol. Mass.:
23245.32
Organism:
Saccharomyces cerevisiae S288c
Description:
gi_285814664
Residue:
222
  
Inhibitor
Name:
BDBM78218
Synonyms:
(E)-4-(3-nitroanilino)-4-oxo-2-butenoic acid ethyl ester MLS000389828 cid_2140300 ethyl (E)-4-[(3-nitrophenyl)amino]-4-oxidanylidene-but-2-enoate
Type:
Small organic molecule
Emp. Form.:
C12H12N2O5
Mol. Mass.:
264.2341
SMILES:
CCOC(=O)\C=C\C(=O)Nc1cccc(c1)[N+]([O-])=O
: