Target
Mitochondrial import inner membrane translocase subunit TIM23
Ligand
BDBM60102
Substrate
Meas. Tech.
Dose Response confirmation of uHTS small molecule inhibitors of tim10-1: a luminescent tim23-1 yeast counterscreen.
IC50
4100±n/a nM
Citation
 PubChem, PC Dose Response confirmation of uHTS small molecule inhibitors of tim10-1: a luminescent tim23-1 yeast counterscreen. PubChem Bioassay (2011)[AID] 
Target
Name:
Mitochondrial import inner membrane translocase subunit TIM23
Synonyms:
MAS6 MPI3 TIM23_YEAST | TPA: Essential component of the Translocase of the Inner Mitochondrial membrane (TIM23 complex)
Type:
Enzyme Catalytic Domain
Mol. Mass.:
23245.32
Organism:
Saccharomyces cerevisiae S288c
Description:
gi_285814664
Residue:
222
  
Inhibitor
Name:
BDBM60102
Synonyms:
1-(2-ethoxyphenyl)-3-[(5-phenyl-1H-1,2,4-triazol-3-yl)sulfanyl]pyrrolidine-2,5-dione 1-(2-ethoxyphenyl)-3-[(5-phenyl-4H-1,2,4-triazol-3-yl)thio]-2,5-pyrrolidinedione MLS000677488 cid_2927161
Type:
Small organic molecule
Emp. Form.:
C20H18N4O3S
Mol. Mass.:
394.447
SMILES:
CCOc1ccccc1-n1c(O)cc(Sc2nnc([nH]2)-c2ccccc2)c1O
: