Target
Orexin/Hypocretin receptor type 1
Ligand
BDBM76454
Substrate
Meas. Tech.
Homogeneous Time Resolved Fluorescence (HTRF)-based cell-based high throughput dose response assay for antagonists of the orexin 1 receptor (OX1R; HCRTR1)
IC50
2514±n/a nM
Citation
 PubChem, PC Homogeneous Time Resolved Fluorescence (HTRF)-based cell-based high throughput dose response assay for antagonists of the orexin 1 receptor (OX1R; HCRTR1) PubChem Bioassay (2011)[AID] 
Target
Name:
Orexin/Hypocretin receptor type 1
Synonyms:
HCRTR1 OX1R_HUMAN Orexin receptor type 1 (OR 1) Orexin receptor type 1 (OX1) Orexin receptor type 1 (OxR1) | Ox1r
Type:
Protein
Mol. Mass.:
47554.50
Organism:
Homo sapiens (Human)
Description:
O43613
Residue:
425
  
Inhibitor
Name:
BDBM76454
Synonyms:
(6Z)-6-[5-[(E)-2-(3,4-dimethoxyphenyl)ethenyl]-1,2-dihydro-1,2,4-triazol-3-ylidene]-1-cyclohexa-2,4-dienone (6Z)-6-[5-[(E)-2-(3,4-dimethoxyphenyl)vinyl]-1,2-dihydro-1,2,4-triazol-3-ylidene]cyclohexa-2,4-dien-1-one MLS000583690 cid_5807995
Type:
Small organic molecule
Emp. Form.:
C18H17N3O3
Mol. Mass.:
323.3459
SMILES:
COc1ccc(C=Cc2nnc([nH]2)-c2ccccc2O)cc1OC
: