Target
DNA dC->dU-editing enzyme APOBEC-3G
Ligand
BDBM47764
Substrate
Meas. Tech.
Dose Response confirmation of small molecule APOBEC3G DNA Deaminase Inhibitors via a fluorescence-based single-stranded DNA deaminase assay
Temperature
298.15±n/a K
IC50
5470±n/a nM
Comments
extracted
Citation
 PubChem, PC Dose Response confirmation of small molecule APOBEC3G DNA Deaminase Inhibitors via a fluorescence-based single-stranded DNA deaminase assay PubChem Bioassay (2011)[AID] 
Target
Name:
DNA dC->dU-editing enzyme APOBEC-3G
Synonyms:
ABC3G_HUMAN | APOBEC3G
Type:
Enzyme Catalytic Domain
Mol. Mass.:
46419.54
Organism:
Homo sapiens (Human)
Description:
gi_13399304
Residue:
384
  
Inhibitor
Name:
BDBM47764
Synonyms:
(4E)-5-methyl-4-[[3-[[(Z)-(3-methyl-1-phenyl-5-sulfanylidene-4-pyrazolylidene)methyl]amino]propylamino]methylidene]-2-phenyl-3-pyrazolethione (4E)-5-methyl-4-[[3-[[(Z)-(3-methyl-1-phenyl-5-sulfanylidenepyrazol-4-ylidene)methyl]amino]propylamino]methylidene]-2-phenylpyrazole-3-thione 3-methyl-4-{[(3-{[(3-methyl-1-phenyl-5-sulfanyl-1H-pyrazol-4-yl)methylene]amino}propyl)imino]methyl}-1-phenyl-1H-pyrazole-5-thiol SMR000225437 | cid_5581000
Type:
Small organic molecule
Emp. Form.:
C25H26N6S2
Mol. Mass.:
474.644
SMILES:
Cc1[nH]n(-c2ccccc2)c(=S)c1C=NCCCN=Cc1c(C)[nH]n(-c2ccccc2)c1=S
: