Target
DNA dC->dU-editing enzyme APOBEC-3A
Ligand
BDBM80098
Substrate
Meas. Tech.
Dose Response confirmation of APOBEC3G DNA Deaminase Inhibitors via a A3A counterscreen
Temperature
298.15±n/a K
IC50
>100000±n/a nM
Comments
extracted
Citation
 PubChem, PC Dose Response confirmation of APOBEC3G DNA Deaminase Inhibitors via a A3A counterscreen PubChem Bioassay (2011)[AID] 
Target
Name:
DNA dC->dU-editing enzyme APOBEC-3A
Synonyms:
ABC3A_HUMAN probable DNA dC->dU-editing enzyme APOBEC-3A
Type:
Enzyme Catalytic Domain
Mol. Mass.:
23013.77
Organism:
Homo sapiens (Human)
Description:
gi_21955158
Residue:
199
  
Inhibitor
Name:
BDBM80098
Synonyms:
5-ethyl-4,6-dimethyl-2-sulfanylidene-1H-pyridine-3-carbonitrile MLS000037800 cid_658169
Type:
Small organic molecule
Emp. Form.:
C10H12N2S
Mol. Mass.:
192.281
SMILES:
CCc1c(C)[nH]c(=S)c(C#N)c1C
: