Target
DNA dC->dU-editing enzyme APOBEC-3G
Ligand
BDBM80405
Substrate
Meas. Tech.
Dose Response confirmation of APOBEC3A DNA Deaminase Inhibitors via a A3G counterscreen
Temperature
298.15±n/a K
IC50
2300±110 nM
Comments
extracted
Citation
 PubChem, PC Dose Response confirmation of APOBEC3A DNA Deaminase Inhibitors via a A3G counterscreen PubChem Bioassay (2011)[AID] 
Target
Name:
DNA dC->dU-editing enzyme APOBEC-3G
Synonyms:
ABC3G_HUMAN | APOBEC3G
Type:
Enzyme Catalytic Domain
Mol. Mass.:
46419.54
Organism:
Homo sapiens (Human)
Description:
gi_13399304
Residue:
384
  
Inhibitor
Name:
BDBM80405
Synonyms:
1-methyl-3-phenyl-6,7,8,9-tetrahydro-5H-imidaz[1,2-a]azepin-1-ium;iodide MLS000565397 cid_9551989
Type:
Small organic molecule
Emp. Form.:
C15H19N2
Mol. Mass.:
227.3242
SMILES:
C[n+]1cc(-c2ccccc2)n2CCCCCc12
: