Target
DNA dC->dU-editing enzyme APOBEC-3G
Ligand
BDBM76188
Substrate
Meas. Tech.
Dose Response confirmation of APOBEC3A DNA Deaminase Inhibitors via a A3G counterscreen
Temperature
298.15±n/a K
IC50
65500±4677 nM
Comments
extracted
Citation
 PubChem, PC Dose Response confirmation of APOBEC3A DNA Deaminase Inhibitors via a A3G counterscreen PubChem Bioassay (2011)[AID] 
Target
Name:
DNA dC->dU-editing enzyme APOBEC-3G
Synonyms:
ABC3G_HUMAN | APOBEC3G
Type:
Enzyme Catalytic Domain
Mol. Mass.:
46419.54
Organism:
Homo sapiens (Human)
Description:
gi_13399304
Residue:
384
  
Inhibitor
Name:
BDBM76188
Synonyms:
1-methyl-5-methylsulfonyl-3-nitro-1,2,4-triazole MLS000678365 cid_3148843
Type:
Small organic molecule
Emp. Form.:
C4H6N4O4S
Mol. Mass.:
206.18
SMILES:
Cn1nc(nc1S(C)(=O)=O)[N+]([O-])=O
: