Target
DNA dC->dU-editing enzyme APOBEC-3A
Ligand
BDBM76188
Substrate
Meas. Tech.
Dose Response confirmation of small molecule APOBEC3A DNA Deaminase Inhibitors via a fluorescence-based single-stranded DNA deaminase assay
Temperature
298.15±n/a K
IC50
4140±n/a nM
Comments
extracted
Citation
 PubChem, PC Dose Response confirmation of small molecule APOBEC3A DNA Deaminase Inhibitors via a fluorescence-based single-stranded DNA deaminase assay PubChem Bioassay (2011)[AID] 
Target
Name:
DNA dC->dU-editing enzyme APOBEC-3A
Synonyms:
ABC3A_HUMAN probable DNA dC->dU-editing enzyme APOBEC-3A
Type:
Enzyme Catalytic Domain
Mol. Mass.:
23013.77
Organism:
Homo sapiens (Human)
Description:
gi_21955158
Residue:
199
  
Inhibitor
Name:
BDBM76188
Synonyms:
1-methyl-5-methylsulfonyl-3-nitro-1,2,4-triazole MLS000678365 cid_3148843
Type:
Small organic molecule
Emp. Form.:
C4H6N4O4S
Mol. Mass.:
206.18
SMILES:
Cn1nc(nc1S(C)(=O)=O)[N+]([O-])=O
: