Target
Tyrosine-protein kinase ABL1 [1-999,Y253H]
Ligand
BDBM81374
Substrate
Meas. Tech.
In Vitro Activity Assay
pH
7.5±0
Kd
9.4±1.2 nM
Citation
 Ranjitkar, PBrock, AMMaly, DJ Affinity reagents that target a specific inactive form of protein kinases. Chem Biol 17:195-206 (2010)  
Target
Name:
Tyrosine-protein kinase ABL1 [1-999,Y253H]
Synonyms:
ABL ABL1_HUMAN Tyrosine-protein kinase ABL (Y253H)
Type:
Protein
Mol. Mass.:
108554.97
Organism:
Homo sapiens (Human)
Description:
P00519[1-999,Y253H]
Residue:
999
  
Inhibitor
Name:
BDBM81374
Synonyms:
BODIPY-labeled probe, 4a
Type:
Small organic molecule
Emp. Form.:
C50H49BF4N11O4
Mol. Mass.:
954.799
SMILES:
Cc1cc(C)n2B(F)[N+]3=C(CCC(=O)NCCCCC(=O)NCCOc4ccc(Nc5ncnc(n5)-c5cccnc5Nc5cc(NC(=O)c6cccc(c6)C(F)(F)F)ccc5C)cc4)C=CC3=Cc12
: