Target
Bis(5'-adenosyl)-triphosphatase
Ligand
BDBM81579
Substrate
Meas. Tech.
Enzyme Inhibition Assay
Ki
3000±0.0 nM
Citation
 Varnum, JMBaraniak, JKaczmarek, RStec, WJBrenner, C Di-, tri- and tetra-5'-O-phosphorothioadenosyl substituted polyols as inhibitors of Fhit: Importance of the alpha-beta bridging oxygen and beta phosphorus replacement. BMC Chem Biol 1:3 (2001)  
Target
Name:
Bis(5'-adenosyl)-triphosphatase
Synonyms:
AP3A hydrolase Bis(5'adenosyl)-triphosphatase FHIT Fragile histidine triad protein
Type:
Protein
Mol. Mass.:
16861.00
Organism:
Homo sapiens (Human)
Description:
P49789
Residue:
147
  
Inhibitor
Name:
BDBM81579
Synonyms:
AppppA analog, 8 (X=S)
Type:
Small organic molecule
Emp. Form.:
C23H31N11O12P2S2
Mol. Mass.:
779.637
SMILES:
NC(COP([O-])(=S)OCC1OC(C(O)C1O)n1cnc2c(N)ncnc12)COP([S-])(=O)OCC1OC(C(O)C1O)n1cnc2c(N)ncnc12
: