Target
Bis(5'-adenosyl)-triphosphatase
Ligand
BDBM81593
Substrate
Meas. Tech.
Enzyme Inhibition Assay
Ki
110±0.0 nM
Citation
 Varnum, JMBaraniak, JKaczmarek, RStec, WJBrenner, C Di-, tri- and tetra-5'-O-phosphorothioadenosyl substituted polyols as inhibitors of Fhit: Importance of the alpha-beta bridging oxygen and beta phosphorus replacement. BMC Chem Biol 1:3 (2001)  
Target
Name:
Bis(5'-adenosyl)-triphosphatase
Synonyms:
AP3A hydrolase Bis(5'adenosyl)-triphosphatase FHIT Fragile histidine triad protein
Type:
Protein
Mol. Mass.:
16861.00
Organism:
Homo sapiens (Human)
Description:
P49789
Residue:
147
  
Inhibitor
Name:
BDBM81593
Synonyms:
AppppA analog, 17 (X=S)
Type:
Small organic molecule
Emp. Form.:
C23H29N10O15P3S3
Mol. Mass.:
874.653
SMILES:
Nc1ncnc2n(cnc12)C1OC(COP([O-])(=S)OCC(COP([S-])(=O)OCC2OC(C(O)C2O)n2cnc3c(N)ncnc23)OP([O-])([S-])=O)C(O)C1O
: