Target
5-hydroxytryptamine receptor 2A
Ligand
BDBM81779
Substrate
Ki
355±n/a nM
Comments
PDSP_3931
Citation
 Andersen, PHGrønvald, FCHohlweg, RHansen, LBGuddal, EBraestrup, CNielsen, EB NNC-112, NNC-687 and NNC-756, new selective and highly potent dopamine D1 receptor antagonists. Eur J Pharmacol 219:45-52 (1992)  
Target
Name:
5-hydroxytryptamine receptor 2A
Synonyms:
5-HT-2A 5-HT2A 5-hydroxytryptamine receptor 2A (5HT2A) Htr2 Serotonin Receptor 2A
Type:
G Protein-Coupled Receptor (GPCR)
Mol. Mass.:
52852.05
Organism:
Rattus norvegicus (rat)
Description:
Rat cortex membranes 5-HT2A receptors.
Residue:
471
  
Inhibitor
Name:
BDBM81779
Synonyms:
CAS_164252 NSC_164252
Type:
Small organic molecule
Emp. Form.:
C19H20N2O4
Mol. Mass.:
340.3731
SMILES:
CN1CCc2cc(c(O)cc2C(C1)c1cccc2CCOc12)[N+]([O-])=O
: