Target
D(1A) dopamine receptor
Ligand
BDBM81779
Substrate
Ki
5.8±n/a nM
Comments
PDSP_3931
Citation
 Andersen, PHGrønvald, FCHohlweg, RHansen, LBGuddal, EBraestrup, CNielsen, EB NNC-112, NNC-687 and NNC-756, new selective and highly potent dopamine D1 receptor antagonists. Eur J Pharmacol 219:45-52 (1992)  
Target
Name:
D(1A) dopamine receptor
Synonyms:
DOPAMINE D1 Dopamine D1 high Dopamine receptor Dopamine1-like Drd1a
Type:
Enzyme Catalytic Domain
Mol. Mass.:
49429.75
Organism:
RAT
Description:
P18901
Residue:
446
  
Inhibitor
Name:
BDBM81779
Synonyms:
CAS_164252 NSC_164252
Type:
Small organic molecule
Emp. Form.:
C19H20N2O4
Mol. Mass.:
340.3731
SMILES:
CN1CCc2cc(c(O)cc2C(C1)c1cccc2CCOc12)[N+]([O-])=O
: