Target
Adenosine receptor A2a
Ligand
BDBM81787
Substrate
Ki
1360±n/a nM
Comments
PDSP_2629
Citation
 Daly, JWPadgett, WL Agonist activity of 2- and 5'-substituted adenosine analogs and their N6-cycloalkyl derivatives at A1- and A2-adenosine receptors coupled to adenylate cyclase. Biochem Pharmacol 43:1089-93 (1992)  
Target
Name:
Adenosine receptor A2a
Synonyms:
AA2AR_RAT Adenosine A2 receptor Adenosine Receptors A2a (A2a) Adenosine receptors A2a Rat striatal adenosine A2a receptor
Type:
G Protein-Coupled Receptor (GPCR)
Mol. Mass.:
45015.65
Organism:
Rattus norvegicus (rat)
Description:
Rat A2A receptors expressed in CHO cells.
Residue:
410
  
Inhibitor
Name:
BDBM81787
Synonyms:
N6-Cyclopentyl-5'chloro Adenosine | N6-Cyclopentyl-5'chloroAdo
Type:
Emp. Form.:
C14H18ClN5O3
Mol. Mass.:
339.777
SMILES:
O[C@@H]1[C@@H](Cl)O[C@H]([C@@H]1O)n1cnc2c(NC3CCCC3)ncnc12
: