Target
5-hydroxytryptamine receptor 1B
Ligand
BDBM81885
Substrate
Ki
10.72±n/a nM
Comments
PDSP_6651
Citation
 Tsuchihashi, HNakashima, YKinami, JNagatomo, T Characteristics of 125I-iodocyanopindolol binding to beta-adrenergic and serotonin-1B receptors of rat brain: selectivity of beta-adrenergic agents. Jpn J Pharmacol 52:195-200 (1990)  
Target
Name:
5-hydroxytryptamine receptor 1B
Synonyms:
5-HT-1B 5-hydroxytryptamine receptor 1B (5HT1B) 5ht1b Serotonin 1 (5-HT1) receptor Serotonin receptor 1B
Type:
Protein
Mol. Mass.:
43173.33
Organism:
Rattus norvegicus (Rat)
Description:
P28564
Residue:
386
  
Inhibitor
Name:
BDBM81885
Synonyms:
2-(3-tert-Butylamino-2-hydroxypropylthio)-4-(5-carbamoyl-2-thienyl)thiazole CAS_52560-77-7
Type:
Small organic molecule
Emp. Form.:
C15H21N3O2S3
Mol. Mass.:
371.541
SMILES:
CC(C)(C)NCC(O)CSc1nc(cs1)-c1ccc(s1)C(N)=O
: