Target
Platelet-activating factor receptor
Ligand
BDBM50001747
Substrate
Ki
231±n/a nM
Comments
PDSP_1010
Citation
 Tahraoui, LFloch, ACavero, I Functional validation of platelet-activating factor receptor sites characterized biochemically by a specific and reproducible [3H]platelet-activating factor binding in human platelets. J Pharmacol Exp Ther 252:1221-7 (1990) Target
Name:
Platelet-activating factor receptor
Synonyms:
PAF Platelet activating factor PAFR PTAFR_HUMAN Platelet-activating factor receptor
Type:
Enzyme Catalytic Domain
Mol. Mass.:
39219.60
Organism:
Homo sapiens (Human)
Description:
PAF Platelet activating factor PTAFR HUMAN::P25105
Residue:
342
  
Inhibitor
Name:
BDBM50001747
Synonyms:
(+)-Kadsurenone 5-Allyl-2-(3,4-dimethoxy-phenyl)-3a-methoxy-3-methyl-3,3a-dihydro-2H-benzofuran-6-one KADSURENONE
Type:
Small organic molecule
Emp. Form.:
C21H24O5
Mol. Mass.:
356.4123
SMILES:
COc1ccc(cc1OC)[C@H]1OC2=CC(=O)C(CC=C)=C[C@]2(OC)[C@@H]1C
: