Target
Cholecystokinin
Ligand
BDBM50061220
Substrate
Ki
2.2±n/a nM
Comments
PDSP_2199
Citation
 Lotti, VJChang, RS A new potent and selective non-peptide gastrin antagonist and brain cholecystokinin receptor (CCK-B) ligand: L-365,260. Eur J Pharmacol 162:273-80 (1989)  
Target
Name:
Cholecystokinin
Synonyms:
CCK Cholecystokinin B
Type:
Enzyme Catalytic Domain
Mol. Mass.:
12528.64
Organism:
GUINEA PIG
Description:
Cholecystokinin B 0 GUINEA PIG::P01356
Residue:
114
  
Inhibitor
Name:
BDBM50061220
Synonyms:
1-((S)-1-Methyl-2-oxo-5-phenyl-2,3-dihydro-1H-benzo[e][1,4]diazepin-3-yl)-3-m-tolyl-urea 1-(1-Methyl-2-oxo-5-phenyl-2,3-dihydro-1H-benzo[e][1,4]diazepin-3-yl)-3-m-tolyl-urea((S)L365_260) L-365,260
Type:
Small organic molecule
Emp. Form.:
C24H22N4O2
Mol. Mass.:
398.4571
SMILES:
CN1c2ccccc2C(=N[C@H](NC(=O)Nc2cccc(C)c2)C1=O)c1ccccc1
: