Target
Cannabinoid receptor 1
Ligand
BDBM82141
Substrate
Meas. Tech.
Binding Assay
pH
7.4±0
Temperature
298.15±0 K
Ki
7.3±1.3 nM
Citation
 Mazzoni, ODiurno, MVdi Bosco, AMNovellino, EGrieco, PEsposito, GBertamino, ACalignano, ARusso, R Synthesis and pharmacological evaluation of analogs of indole-based cannabimimetic agents. Chem Biol Drug Des 75:106-14 (2010)  
Target
Name:
Cannabinoid receptor 1
Synonyms:
Brain-type cannabinoid receptor CB-R CNR1_RAT Cannabinoid receptor Cnr1 | Skr6
Type:
G Protein-Coupled Receptor (GPCR)
Mol. Mass.:
52856.55
Organism:
Rattus norvegicus (rat)
Description:
P20272
Residue:
473
  
Inhibitor
Name:
BDBM82141
Synonyms:
WIN 55212-2
Type:
Small organic molecule
Emp. Form.:
C27H28N2O3
Mol. Mass.:
428.5228
SMILES:
CC1=C(C2C=CC=C3OC[C@@H](CN4CCOCC4)N1C23)C(=O)c1cccc2ccccc12
: