Target
Type-2 angiotensin II receptor
Ligand
BDBM50010361
Substrate
Ki
>10000±n/a nM
Comments
PDSP_810
Citation
 Kushida, HNomura, SMorita, OHarasawa, YSuzuki, MNakano, MOzawa, KKunihara, M Pharmacological characterization of the nonpeptide angiotensin II receptor antagonist, U-97018. J Pharmacol Exp Ther 274:1042-53 (1995) Target
Name:
Type-2 angiotensin II receptor
Synonyms:
AGTR2_RAT Agtr2 Angiotensin II receptor Type-2 angiotensin II receptor
Type:
Enzyme Catalytic Domain
Mol. Mass.:
41346.62
Organism:
RAT
Description:
Angiotensin II AT2 0 0::P35351
Residue:
363
  
Inhibitor
Name:
BDBM50010361
Synonyms:
(S)-1-(4-Amino-3-methyl-benzyl)-5-diphenylacetyl-4,5,6,7-tetrahydro-1H-imidazo[4,5-c]pyridine-6-carboxylic acid 1-(4-amino-2-methylbenzyl)-5-diphenylcarbamoyl-(6S)-4,5,6,7-tetrahydro-1H-imidazo[5,4-c]pyridine-6-carboxylic acid EXP655 PD-123177
Type:
Small organic molecule
Emp. Form.:
C29H28N4O3
Mol. Mass.:
480.5576
SMILES:
Cc1cc(Cn2cnc3CN([C@@H](Cc23)C(O)=O)C(=O)C(c2ccccc2)c2ccccc2)ccc1N
: