Target
Type-2 angiotensin II receptor
Ligand
BDBM82259
Substrate
Ki
7.9±n/a nM
Comments
PDSP_1019
Citation
 Kushida, HNomura, SMorita, OHarasawa, YSuzuki, MNakano, MOzawa, KKunihara, M Pharmacological characterization of the nonpeptide angiotensin II receptor antagonist, U-97018. J Pharmacol Exp Ther 274:1042-53 (1995) Target
Name:
Type-2 angiotensin II receptor
Synonyms:
AGTR2_RAT Agtr2 Angiotensin II receptor Type-2 angiotensin II receptor
Type:
Enzyme Catalytic Domain
Mol. Mass.:
41346.62
Organism:
RAT
Description:
Angiotensin II AT2 0 0::P35351
Residue:
363
  
Inhibitor
Name:
BDBM82259
Synonyms:
CAS_123856 NSC_123856
Type:
Small organic molecule
Emp. Form.:
C23H21N7
Mol. Mass.:
395.4597
SMILES:
CCc1nc2c(C)cc(C)nc2n1-c1ccc(cc1)-c1ccccc1-c1nnn[nH]1
: