Target
Delta-type opioid receptor
Ligand
BDBM50027391
Substrate
Ki
169±n/a nM
Comments
PDSP_4105
Citation
 Codd, EEShank, RPSchupsky, JJRaffa, RB Serotonin and norepinephrine uptake inhibiting activity of centrally acting analgesics: structural determinants and role in antinociception. J Pharmacol Exp Ther 274:1263-70 (1995) Target
Name:
Delta-type opioid receptor
Synonyms:
Cytochrome P450 3A4 Delta opioid receptor Delta-type opioid receptor (DOR) OPRD_RAT Opioid receptor Opioid receptors; mu & delta Ror-a | Voltage-gated potassium channel
Type:
G Protein-Coupled Receptor (GPCR)
Mol. Mass.:
40465.04
Organism:
Rattus norvegicus (rat)
Description:
Competition binding assays were using CHO-K1 cell membranes expressing the opioid receptor.
Residue:
372
  
Inhibitor
Name:
BDBM50027391
Synonyms:
Acetic acid (1S,4S)-4-dimethylamino-1-ethyl-2,2-diphenyl-pentyl ester Alphacetylmethadol Methadyl acetate | alpha-(-)-Acetylmethadol
Type:
Small organic molecule
Emp. Form.:
C23H31NO2
Mol. Mass.:
353.4977
SMILES:
CCC(OC(C)=O)C(CC(C)N(C)C)(c1ccccc1)c1ccccc1
: