Target
Melanocortin receptor 5
Ligand
BDBM82413
Substrate
Ki
>10000±n/a nM
Comments
PDSP_2958
Citation
 Schiöth, HBMuceniece, RWikberg, JEChhajlani, V Characterisation of melanocortin receptor subtypes by radioligand binding analysis. Eur J Pharmacol 288:311-7 (1995)  
Target
Name:
Melanocortin receptor 5
Synonyms:
MC-2 MC5R Melanocortin MC5 Melanocortin receptor 5 | Melanocortin receptor 5 (MC5R)
Type:
Enzyme
Mol. Mass.:
36612.92
Organism:
Homo sapiens (Human)
Description:
P33032
Residue:
325
  
Inhibitor
Name:
BDBM82413
Synonyms:
CAS_72711-43-4 Gamma2-MSH
Type:
Small organic molecule
Emp. Form.:
C74H99N21O16S
Mol. Mass.:
1570.774
SMILES:
CSCC[C@H](NC(=O)[C@@H](NC(=O)[C@@H](N)Cc1ccc(O)cc1)C(C)C)C(=O)NCC(=O)N[C@@H](Cc1cnc[nH]1)C(=O)N[C@@H](Cc1ccccc1)C(=O)N[C@@H](CCCN=C(N)N)C(=O)N[C@@H](Cc1c[nH]c2ccccc12)C(=O)N[C@@H](CC(O)=O)C(=O)N[C@@H](CCCN=C(N)N)C(=O)N[C@@H](Cc1ccccc1)C(=O)NCC(O)=O
: