Target
Type-2 angiotensin II receptor
Ligand
BDBM50009338
Substrate
Ki
1.6±n/a nM
Comments
PDSP_1661
Citation
 Keiser, JARyan, MJPanek, RLHodges, JCSircar, I Pharmacologic characterization of CI-996, a new angiotensin receptor antagonist. J Pharmacol Exp Ther 272:963-9 (1995) Target
Name:
Type-2 angiotensin II receptor
Synonyms:
AGTR2_RAT Agtr2 Angiotensin II receptor Type-2 angiotensin II receptor
Type:
Enzyme Catalytic Domain
Mol. Mass.:
41346.62
Organism:
RAT
Description:
Angiotensin II AT2 0 0::P35351
Residue:
363
  
Inhibitor
Name:
BDBM50009338
Synonyms:
(S)-2-((S)-1-((S)-2-((S)-2-((S)-2-((S)-2-((S)-5-(diaminomethyleneamino)-2-(2-(methylamino)acetamido)pentanamido)-3-methylbutanamido)-3-(4-hydroxyphenyl)propanamido)-3-methylbutanamido)-3-(1H-imidazol-5-yl)propanoyl)pyrrolidine-5-carboxamido)propanoic acid SARALASIN Sar-Arg-Val-Tyr-Val-His-Pro-Ala (sarlasin) | [Sar1-Arg2-Val3-Tyr4-Val5-His6-Pro7-Ala8]
Type:
Small organic molecule
Emp. Form.:
C42H65N13O10
Mol. Mass.:
912.0466
SMILES:
CNCC(=O)N[C@@H](CCCN=C(N)N)C(=O)N[C@@H](C(C)C)C(=O)N[C@@H](Cc1ccc(O)cc1)C(=O)N[C@@H](C(C)C)C(=O)N[C@@H](Cc1cnc[nH]1)C(=O)N1CCC[C@H]1C(=O)N[C@@H](C)C(O)=O
: