Target
Type-2 angiotensin II receptor
Ligand
BDBM50011977
Substrate
Ki
>10000±n/a nM
Comments
PDSP_1718
Citation
 Keiser, JARyan, MJPanek, RLHodges, JCSircar, I Pharmacologic characterization of CI-996, a new angiotensin receptor antagonist. J Pharmacol Exp Ther 272:963-9 (1995) Target
Name:
Type-2 angiotensin II receptor
Synonyms:
AGTR2_RAT Agtr2 Angiotensin II receptor Type-2 angiotensin II receptor
Type:
Enzyme Catalytic Domain
Mol. Mass.:
41346.62
Organism:
RAT
Description:
Angiotensin II AT2 0 0::P35351
Residue:
363
  
Inhibitor
Name:
BDBM50011977
Synonyms:
(E)-2-butyl-1-(p-carboxybenzyl)-alpha-2-thenylimidazole-5-acrylic acid (E)-alpha{[2-butyl-1-[(4-carboxyphenyl)methyl]-1H-imidazole-5-yl]methylene}-2-thiopheneproprionic acid CHEMBL813 | EPROSARTAN
Type:
Small organic molecule
Emp. Form.:
C23H24N2O4S
Mol. Mass.:
424.513
SMILES:
CCCCc1ncc(\C=C(/Cc2cccs2)C(O)=O)n1Cc1ccc(cc1)C(O)=O
: