Target
5-hydroxytryptamine receptor 6
Ligand
BDBM50040237
Substrate
Ki
16±n/a nM
Comments
PDSP_551
Citation
 Roth, BLCraigo, SCChoudhary, MSUluer, AMonsma, FJShen, YMeltzer, HYSibley, DR Binding of typical and atypical antipsychotic agents to 5-hydroxytryptamine-6 and 5-hydroxytryptamine-7 receptors. J Pharmacol Exp Ther 268:1403-10 (1994) Target
Name:
5-hydroxytryptamine receptor 6
Synonyms:
5-HT-6 5-hydroxytryptamine receptor 6 Htr6 Serotonin (5-HT) receptor Serotonin receptor 6
Type:
Enzyme Catalytic Domain
Mol. Mass.:
46945.51
Organism:
RAT
Description:
5-HT6 HTR6 RAT::P31388
Residue:
436
  
Inhibitor
Name:
BDBM50040237
Synonyms:
2-Chloro-11-(4-methyl-piperazin-1-yl)-dibenzo[b,f][1,4]thiazepine 2-chloro-11-(4-methylpiperazin-1-yl)dibenzo[b,f][1,4]thiazepine Clothiapine
Type:
Small organic molecule
Emp. Form.:
C18H18ClN3S
Mol. Mass.:
343.874
SMILES:
CN1CCN(CC1)C1=Nc2ccccc2Sc2ccc(Cl)cc12
: