Target
Beta-1 adrenergic receptor
Ligand
BDBM82502
Substrate
Ki
630.95±n/a nM
Comments
PDSP_1877
Citation
 Fraundorfer, PFFertel, RHMiller, DDFeller, DR Biochemical and pharmacological characterization of high-affinity trimetoquinol analogs on guinea pig and human beta adrenergic receptor subtypes: evidence for partial agonism. J Pharmacol Exp Ther 270:665-74 (1994) Target
Name:
Beta-1 adrenergic receptor
Synonyms:
ADRB1 adrenergic Beta1
Type:
Enzyme Catalytic Domain
Mol. Mass.:
50540.48
Organism:
GUINEA PIG
Description:
adrenergic Beta1 ADRB1 GUINEA PIG::B0FL73
Residue:
467
  
Inhibitor
Name:
BDBM82502
Synonyms:
TMQ, 8-Iodo
Type:
Small organic molecule
Emp. Form.:
C19H22INO5
Mol. Mass.:
471.2862
SMILES:
COc1cc(CC2NCCc3cc(O)c(O)c(I)c23)cc(OC)c1OC
: