Target
Beta-1 adrenergic receptor
Ligand
BDBM82486
Substrate
Ki
323.59±n/a nM
Comments
PDSP_1886
Citation
 Fraundorfer, PFFertel, RHMiller, DDFeller, DR Biochemical and pharmacological characterization of high-affinity trimetoquinol analogs on guinea pig and human beta adrenergic receptor subtypes: evidence for partial agonism. J Pharmacol Exp Ther 270:665-74 (1994) Target
Name:
Beta-1 adrenergic receptor
Synonyms:
ADRB1 adrenergic Beta1
Type:
Enzyme Catalytic Domain
Mol. Mass.:
50540.48
Organism:
GUINEA PIG
Description:
adrenergic Beta1 ADRB1 GUINEA PIG::B0FL73
Residue:
467
  
Inhibitor
Name:
BDBM82486
Synonyms:
TMQ, N-methoxybenzyl | TMQ, N-methyl
Type:
Small organic molecule
Emp. Form.:
C20H25NO5
Mol. Mass.:
359.4162
SMILES:
COc1cc(CC2N(C)CCc3cc(O)c(O)cc23)cc(OC)c1OC
: