Target
Beta-1 adrenergic receptor
Ligand
BDBM82503
Substrate
Ki
109.64±n/a nM
Comments
PDSP_1891
Citation
 Fraundorfer, PFFertel, RHMiller, DDFeller, DR Biochemical and pharmacological characterization of high-affinity trimetoquinol analogs on guinea pig and human beta adrenergic receptor subtypes: evidence for partial agonism. J Pharmacol Exp Ther 270:665-74 (1994) Target
Name:
Beta-1 adrenergic receptor
Synonyms:
ADRB1 adrenergic Beta1
Type:
Enzyme Catalytic Domain
Mol. Mass.:
50540.48
Organism:
GUINEA PIG
Description:
adrenergic Beta1 ADRB1 GUINEA PIG::B0FL73
Residue:
467
  
Inhibitor
Name:
BDBM82503
Synonyms:
CAS_65772 TMQ, S-(-)
Type:
Small organic molecule
Emp. Form.:
C19H23NO5
Mol. Mass.:
345.3896
SMILES:
COc1cc(C[C@@H]2NCCc3cc(O)c(O)cc23)cc(OC)c1OC
: