Target
Kappa-type opioid receptor
Ligand
BDBM50013388
Substrate
Ki
2.35±n/a nM
Comments
PDSP_413
Citation
 Standifer, KMCheng, JBrooks, AIHonrado, CPSu, WVisconti, LMBiedler, JLPasternak, GW Biochemical and pharmacological characterization of mu, delta and kappa 3 opioid receptors expressed in BE(2)-C neuroblastoma cells. J Pharmacol Exp Ther 270:1246-55 (1994) Target
Name:
Kappa-type opioid receptor
Synonyms:
K-OR-1 Kappa-opioid receptor (KOR) Kappa-type opioid receptor (KOR) OPIATE Kappa OPRK1 kappa opioid receptor (KOR)
Type:
G Protein-Coupled Receptor (GPCR)
Mol. Mass.:
42648.76
Organism:
Homo sapiens (Human)
Description:
P41145
Residue:
380
  
Inhibitor
Name:
BDBM50013388
Synonyms:
6-Ethyl-3-(1-hydroxy-cyclopropylmethyl)-11,11-dimethyl-1,2,3,4,5,6-hexahydro-2,6-methano-benzo[d]azocin-8-ol Bremazocine | CHEMBL350384
Type:
Small organic molecule
Emp. Form.:
C20H29NO2
Mol. Mass.:
315.4498
SMILES:
CCC12CCN(CC3(O)CC3)C(Cc3ccc(O)cc13)C2(C)C
: