Target
Carboxy-terminal domain RNA polymerase II polypeptide A small phosphatase 1
Ligand
BDBM82596
Substrate
Meas. Tech.
Dose Response confirmation of uHTS hits for Scp-1 phosphatase using a colorimetric assay
IC50
6252±272 nM
Citation
 PubChem, PC Dose Response confirmation of uHTS hits for Scp-1 phosphatase using a colorimetric assay PubChem Bioassay (2011)[AID] 
Target
Name:
Carboxy-terminal domain RNA polymerase II polypeptide A small phosphatase 1
Synonyms:
CTDS1_HUMAN NIF3 SCP1 | carboxy-terminal domain RNA polymerase II polypeptide A small phosphatase 1 isoform 1
Type:
Enzyme Catalytic Domain
Mol. Mass.:
29199.89
Organism:
Homo sapiens (Human)
Description:
gi_10864009
Residue:
261
  
Inhibitor
Name:
BDBM82596
Synonyms:
2-[4-Butyl-5-(2-methyl-furan-3-yl)-4H-[1,2,4]triazol-3-ylsulfanyl]-N-furan-2-ylmethyl-acetamide 2-[[4-butyl-5-(2-methyl-3-furyl)-1,2,4-triazol-3-yl]thio]-N-(2-furfuryl)acetamide 2-[[4-butyl-5-(2-methylfuran-3-yl)-1,2,4-triazol-3-yl]sulfanyl]-N-(furan-2-ylmethyl)ethanamide SMR000005704 | cid_654558
Type:
Small organic molecule
Emp. Form.:
C18H22N4O3S
Mol. Mass.:
374.457
SMILES:
CCCCn1c(SCC(=O)NCc2ccco2)nnc1-c1ccoc1C
: