Target
Phospholipase A2
Ligand
BDBM80944
Substrate
Meas. Tech.
Dose response counterscreen of uHTS hits for ATG4B inhibitors in a Phospholipase A2 assay
IC50
2590±n/a nM
Citation
 PubChem, PC Dose response counterscreen of uHTS hits for ATG4B inhibitors in a Phospholipase A2 assay PubChem Bioassay (2011)[AID] 
Target
Name:
Phospholipase A2
Synonyms:
Group IB phospholipase A2 PLA2 PLA2G1B Phosphatidylcholine 2-acylhydrolase 1B Phospholipase A2 group 1B | phospholipase A2 precursor
Type:
Protein
Mol. Mass.:
16364.13
Organism:
Homo sapiens (Human)
Description:
P04054
Residue:
148
  
Inhibitor
Name:
BDBM80944
Synonyms:
1-(7,8-dihydro-6H-cyclopenta[2,3]thieno[2,4-d]pyrimidin-1-ylsulfanyl)-3,3-dimethyl-butan-2-one 1-(7,8-dihydro-6H-cyclopenta[2,3]thieno[2,4-d]pyrimidin-1-ylthio)-3,3-dimethyl-2-butanone MLS000770752 cid_4811977
Type:
Small organic molecule
Emp. Form.:
C15H18N2OS2
Mol. Mass.:
306.446
SMILES:
CC(C)(C)C(=O)CSc1ncnc2sc3CCCc3c12
: