Target
Endoribonuclease toxin MazF
Ligand
BDBM49178
Substrate
Meas. Tech.
Dose response confirmation uHTS hits for MazEF TA System activators via a fluorescence-based single-stranded RNase assay
EC50
>99000±n/a nM
Citation
 PubChem, PC Dose response confirmation uHTS hits for MazEF TA System activators via a fluorescence-based single-stranded RNase assay PubChem Bioassay (2011)[AID] 
Target
Name:
Endoribonuclease toxin MazF
Synonyms:
MAZF_ECOLI chpAK mazF
Type:
Enzyme Catalytic Domain
Mol. Mass.:
12100.43
Organism:
Escherichia coli str. K-12 substr. MG1655
Description:
gi_16130689
Residue:
111
  
Inhibitor
Name:
BDBM49178
Synonyms:
(3-Cyano-7-methyl-quinolin-2-ylsulfanyl)-acetic acid ethyl ester 2-[(3-cyano-7-methyl-2-quinolyl)thio]acetic acid ethyl ester SMR000001651 ethyl 2-(3-cyano-7-methyl-quinolin-2-yl)sulfanylethanoate | ethyl 2-(3-cyano-7-methylquinolin-2-yl)sulfanylacetate
Type:
Small organic molecule
Emp. Form.:
C15H14N2O2S
Mol. Mass.:
286.349
SMILES:
CCOC(=O)CSc1nc2cc(C)ccc2cc1C#N
: