Target
Endoribonuclease toxin MazF
Ligand
BDBM52119
Substrate
Meas. Tech.
Dose response confirmation uHTS hits for MazEF TA System activators via a fluorescence-based single-stranded RNase assay
EC50
>99000±n/a nM
Citation
 PubChem, PC Dose response confirmation uHTS hits for MazEF TA System activators via a fluorescence-based single-stranded RNase assay PubChem Bioassay (2011)[AID] 
Target
Name:
Endoribonuclease toxin MazF
Synonyms:
MAZF_ECOLI chpAK mazF
Type:
Enzyme Catalytic Domain
Mol. Mass.:
12100.43
Organism:
Escherichia coli str. K-12 substr. MG1655
Description:
gi_16130689
Residue:
111
  
Inhibitor
Name:
BDBM52119
Synonyms:
1-[3-amino-6-(2-thienyl)-4-(trifluoromethyl)thieno[2,3-b]pyridin-2-yl]ethanone 1-[3-amino-6-thiophen-2-yl-4-(trifluoromethyl)thieno[2,3-b]pyridin-2-yl]ethanone MLS000080359 cid_661810
Type:
Small organic molecule
Emp. Form.:
C14H9F3N2OS2
Mol. Mass.:
342.359
SMILES:
CC(=O)c1sc2nc(cc(c2c1N)C(F)(F)F)-c1cccs1
: