Target
Apoptotic protease-activating factor 1
Ligand
BDBM83888
Substrate
Meas. Tech.
Dose Response validation of Activators of Apaf-1 using a Fluorescent Interference Counterscreen assay
EC50
>100000±0 nM
Citation
 PubChem, PC Dose Response validation of Activators of Apaf-1 using a Fluorescent Interference Counterscreen assay PubChem Bioassay (2011)[AID] 
Target
Name:
Apoptotic protease-activating factor 1
Synonyms:
APAF1 Apoptotic peptidase activating factor 1 | KIAA0413
Type:
Enzyme Catalytic Domain
Mol. Mass.:
141834.40
Organism:
Homo sapiens (Human)
Description:
O14727
Residue:
1248
  
Inhibitor
Name:
BDBM83888
Synonyms:
2-[5-[(Z)-(5-keto-1,3-diphenyl-2-pyrazolin-4-ylidene)methyl]-2-furyl]benzoic acid methyl ester MLS000535420 cid_5736973 methyl 2-[5-[(Z)-(5-oxo-1,3-diphenylpyrazol-4-ylidene)methyl]furan-2-yl]benzoate | methyl 2-{5-[(5-oxo-1,3-diphenyl-1,5-dihydro-4H-pyrazol-4-ylidene)methyl]-2-furyl}benzoate
Type:
Small organic molecule
Emp. Form.:
C28H20N2O4
Mol. Mass.:
448.4694
SMILES:
COC(=O)c1ccccc1-c1ccc(\C=C2/C(=O)N(N=C2c2ccccc2)c2ccccc2)o1
: